{"text_format":"3","workbook":"xlsx","n_sheets":3,"sheets":["Employees","ID_Card","Employees_db"],"not_rendered":{"images":38,"macros":1,"defined_names":14},"read":"whole","date_system":"1900"}

{"sheet":"Employees","index":0,"n_rows":18,"n_cols":13,"rows_kept":18}
["Control Panel"]
["Sel Row:",{"$nulls":5},"Employees"]
["Sel Id:"]
["ID Row:",{"$f":"IFERROR(MATCH($B$3,id_emp,0)+3,\"\")","v":""}]
["Scroll Pos:",1]
[]
[]
["Image Refrence",{"$nulls":5},"Emp ID","Emp Name","Designation","DOB","Email","Phone","Photo"]
["img1:",{"$f":"G9","v":1001},{"$nulls":3},{"$f":"B5","v":1},{"$f":"IF(INDEX(tbl_emp,F9,1)=0,\"\",INDEX(tbl_emp,F9,1))","v":1001},{"$f":"IF(INDEX(tbl_emp,F9,2)=0,\"\",INDEX(tbl_emp,F9,2))","v":"Brittany Trump"},{"$f":"IF(INDEX(tbl_emp,F9,3)=0,\"\",INDEX(tbl_emp,F9,3))","v":"CEO"},{"$f":"IF(INDEX(tbl_emp,F9,4)=0,\"\",INDEX(tbl_emp,F9,4))","v":"1992-12-07"},{"$f":"IF(INDEX(tbl_emp,F9,5)=0,\"\",INDEX(tbl_emp,F9,5))","v":"BrittanyT@email.com"},{"$f":"IF(INDEX(tbl_emp,F9,6)=0,\"\",INDEX(tbl_emp,F9,6))","v":8088781874}]
["img2:",1002,{"$nulls":3},{"$f":"F9+1","v":2},1002,"Daniel S. Howard","Historian","17/01/1954","howard@email.com",3232645709]
["img3:",1003,{"$nulls":3},3,1003,"Randall Tierney","Electric Engineer",32115,"Tierney@email.com",9144645499]
["img4:",1004,{"$nulls":3},4,1004,"Alissa C. Holloway","Manager","19/03/1992","Alissa@email.com",6097249090]
["img5:",1005,{"$nulls":3},5,1005,"David Tharp","Executive Assistant",37591,"david@email.com",3308723440]
["img6:","",{"$nulls":3},6,"","","","","",""]
["img7:","",{"$nulls":3},7,"","","","","",""]
["img8:","",{"$nulls":3},8,"","","",null,"",""]
["img9:","",{"$nulls":3},9,"","","","","",""]
["img10:","",{"$nulls":3},10,"","","","","",""]

{"sheet":"ID_Card","index":1,"n_rows":20,"n_cols":11,"rows_kept":20,"merged":[[9,10,13,10],[15,10,19,10]]}
["C-Panel"]
["Flip Control:",2,{"$nulls":4},"ID Card"]
[]
[]
[]
[]
[{"$nulls":6},"Employee Details"]
[]
[{"$nulls":6},"ID Card Front",null,null,"ID Card Back"]
[{"$nulls":6},"Emp Id:",1004,null,"Terms & Condtion :","Lorem ipsum dolor sit amet, consectetur adipiscing elit. Nullam ut aliquet turpis. Nullam mattis sem vitae ligula sollicitudin pretium. "]
[{"$nulls":7},{"$f":"\"*\"&H10&\"*\"","v":"*1004*"}]
[{"$nulls":6},"Emp Name:",{"$f":"IFERROR(INDEX(tbl_emp,MATCH($H$10,id_emp,0),2),\"\")","v":"Alissa C. Holloway"}]
[]
[{"$nulls":6},"Designation:",{"$f":"IFERROR(INDEX(tbl_emp,MATCH($H$10,id_emp,0),3),\"\")","v":"Manager"}]
[]
[{"$nulls":6},"DOB:",{"$f":"IFERROR(INDEX(tbl_emp,MATCH($H$10,id_emp,0),4),\"\")","v":"19/03/1992"},null,"Office Address:","Apt. 881 8674 Friesen Stravenue, North Sebastian, AL 58067-7830"]
[]
[{"$nulls":6},"Email:",{"$f":"IFERROR(INDEX(tbl_emp,MATCH($H$10,id_emp,0),5),\"\")","v":"Alissa@email.com"}]
[]
[{"$nulls":6},"Phone:",{"$f":"IFERROR(INDEX(tbl_emp,MATCH($H$10,id_emp,0),6),\"\")","v":6097249090}]

{"sheet":"Employees_db","index":2,"n_rows":8,"n_cols":7,"rows_kept":8}
["Employee Database",{"$nulls":3},"emp_1002"]
[]
["Emp ID","Emp Name","Designation","DOB","Email","Phone","Photo"]
[1001,"Brittany Trump","CEO","1992-12-07","BrittanyT@email.com",8088781874]
[1002,"Daniel S. Howard","Historian","17/01/1954","howard@email.com",3232645709]
[1003,"Randall Tierney","Electric Engineer","1987-12-04","Tierney@email.com",9144645499]
[1004,"Alissa C. Holloway","Manager","19/03/1992","Alissa@email.com",6097249090]
[1005,"David Tharp","Executive Assistant","2002-12-01","david@email.com",3308723440]