{"text_format":"3","workbook":"xlsx","n_sheets":10,"sheets":["Dashboard","Members","Seats","Books","Settings","Book_Register","Books_inventory","Receipt","Calc","Members_db"],"not_rendered":{"images":30,"macros":1,"defined_names":11},"read":"whole","date_system":"1900"}

{"sheet":"Dashboard","index":0,"n_rows":9,"n_cols":22,"rows_kept":9,"merged":[[4,8,7,9],[4,14,7,15],[4,20,7,21]]}
[]
[{"$nulls":6},"Dashboard"]
[]
[]
[{"$nulls":8},{"$f":"Calc!M3","v":8},{"$nulls":5},{"$f":"Calc!M4","v":7},{"$nulls":5},{"$f":"Calc!M5","v":1}]
[]
[]
[]
[{"$nulls":9},"Total Members",{"$nulls":5},"Active Members",{"$nulls":5},"Expired Members"]

{"sheet":"Members","index":1,"n_rows":23,"n_cols":19,"rows_kept":23}
["C-Panel"]
["Sel Rw:",15,{"$nulls":4},"Members"]
["Sel Seat:","D2"]
["Seat Db Rw:",{"$f":"IFERROR(MATCH(Members!B3,tblMembers[Seat'#],0)+3,\"\")","v":""}]
["Scrl Ctrl:",1,{"$nulls":5},"Members List"]
["Edit Mode:",false]
["Full Name:",{"$f":"IFERROR(VLOOKUP(B3,tblMembers[],2,FALSE),\"\")","v":""}]
["Fname:",{"$f":"IFERROR(TRIM(LEFT(B7,FIND(\" \",B7,1))),\"\")","v":""},{"$nulls":5},"Seat #","Name","Date of Birth","Gender","Address","Phone","Subscription","Amount","Issue Date","Expiry Date","Status","Action"]
["Lname:",{"$f":"TRIM(RIGHT(B7,LEN(B7)-LEN(B8)))","v":""},{"$nulls":3},{"$f":"B5","v":1},null,{"$f":"IFERROR(INDEX(tblMembers[],F9,1),\"\")","v":"A1"},{"$f":"IFERROR(INDEX(tblMembers[],F9,2),\"\")","v":"John Smith"},{"$f":"IFERROR(INDEX(tblMembers[],F9,3),\"\")","v":"2024-12-01"},{"$f":"IFERROR(INDEX(tblMembers[],F9,4),\"\")","v":"Male"},{"$f":"IFERROR(INDEX(tblMembers[],F9,7),\"\")","v":"49, new mal road, shimla - 234345"},{"$f":"IFERROR(INDEX(tblMembers[],F9,8),\"\")","v":9876543210},{"$f":"IFERROR(INDEX(tblMembers[],F9,9),\"\")","v":"1 Month"},{"$f":"IFERROR(INDEX(tblMembers[],F9,10),\"\")","v":{"v":1000,"d":"₹ 1,000"}},{"$f":"IFERROR(INDEX(tblMembers[],F9,11),\"\")","v":"2024-04-07"},{"$f":"IFERROR(INDEX(tblMembers[],F9,12),\"\")","v":"2024-05-05"},{"$f":"IFERROR(INDEX(tblMembers[],F9,13),\"\")","v":"Expired"}]
[{"$nulls":5},{"$f":"F9+1","v":2},null,{"$f":"IFERROR(INDEX(tblMembers[],F10,1),\"\")","v":"B9"},{"$f":"IFERROR(INDEX(tblMembers[],F10,2),\"\")","v":"Dhirendra Modi"},{"$f":"IFERROR(INDEX(tblMembers[],F10,3),\"\")","v":"2020-07-01"},{"$f":"IFERROR(INDEX(tblMembers[],F10,4),\"\")","v":"Male"},{"$f":"IFERROR(INDEX(tblMembers[],F10,7),\"\")","v":"12, Nale par mohalla, Sindhwa - 12345"},{"$f":"IFERROR(INDEX(tblMembers[],F10,8),\"\")","v":1234567890},{"$f":"IFERROR(INDEX(tblMembers[],F10,9),\"\")","v":"1 Month"},{"$f":"IFERROR(INDEX(tblMembers[],F10,10),\"\")","v":{"v":1000,"d":"₹ 1,000"}},{"$f":"IFERROR(INDEX(tblMembers[],F10,11),\"\")","v":"2024-05-06"},{"$f":"IFERROR(INDEX(tblMembers[],F10,12),\"\")","v":"2024-06-05"},{"$f":"IFERROR(INDEX(tblMembers[],F10,13),\"\")","v":"Active"}]
{"$rows_left_out":14}
{"sheet":"Seats","index":2,"n_rows":20,"n_cols":26,"rows_kept":20}
[]
[{"$nulls":6},"Seats Management"]
[]
[]
[]
[{"$nulls":6},{"$f":"IFERROR(IF(MATCH(H6,tblMembers[Seat'#],0)<>0,VLOOKUP(H6,tblMembers[],4,FALSE),\"\"),\"\")","v":"Male"},"A1",{"$f":"IFERROR(IF(MATCH(J6,tblMembers[Seat'#],0)<>0,VLOOKUP(J6,tblMembers[],4,FALSE),\"\"),\"\")","v":""},"B1",{"$f":"IFERROR(IF(MATCH(L6,tblMembers[Seat'#],0)<>0,VLOOKUP(L6,tblMembers[],4,FALSE),\"\"),\"\")","v":""},"C1",{"$f":"IFERROR(IF(MATCH(N6,tblMembers[Seat'#],0)<>0,VLOOKUP(N6,tblMembers[],4,FALSE),\"\"),\"\")","v":""},"D1",{"$f":"IFERROR(IF(MATCH(P6,tblMembers[Seat'#],0)<>0,VLOOKUP(P6,tblMembers[],4,FALSE),\"\"),\"\")","v":""},"E1",{"$f":"IFERROR(IF(MATCH(R6,tblMembers[Seat'#],0)<>0,VLOOKUP(R6,tblMembers[],4,FALSE),\"\"),\"\")","v":""},"F1",{"$f":"IFERROR(IF(MATCH(T6,tblMembers[Seat'#],0)<>0,VLOOKUP(T6,tblMembers[],4,FALSE),\"\"),\"\")","v":""},"G1",{"$f":"IFERROR(IF(MATCH(V6,tblMembers[Seat'#],0)<>0,VLOOKUP(V6,tblMembers[],4,FALSE),\"\"),\"\")","v":""},"H1",{"$f":"IFERROR(IF(MATCH(X6,tblMembers[Seat'#],0)<>0,VLOOKUP(X6,tblMembers[],4,FALSE),\"\"),\"\")","v":""},"I1",{"$f":"IFERROR(IF(MATCH(Z6,tblMembers[Seat'#],0)<>0,VLOOKUP(Z6,tblMembers[],4,FALSE),\"\"),\"\")","v":""},"J1"]
[{"$nulls":6},{"$f":"IFERROR(IF(MATCH(H7,tblMembers[Seat'#],0)<>0,VLOOKUP(H7,tblMembers[],4,FALSE),\"\"),\"\")","v":""},"A2",{"$f":"IFERROR(IF(MATCH(J7,tblMembers[Seat'#],0)<>0,VLOOKUP(J7,tblMembers[],4,FALSE),\"\"),\"\")","v":""},"B2",{"$f":"IFERROR(IF(MATCH(L7,tblMembers[Seat'#],0)<>0,VLOOKUP(L7,tblMembers[],4,FALSE),\"\"),\"\")","v":""},"C2",{"$f":"IFERROR(IF(MATCH(N7,tblMembers[Seat'#],0)<>0,VLOOKUP(N7,tblMembers[],4,FALSE),\"\"),\"\")","v":""},"D2",{"$f":"IFERROR(IF(MATCH(P7,tblMembers[Seat'#],0)<>0,VLOOKUP(P7,tblMembers[],4,FALSE),\"\"),\"\")","v":""},"E2",{"$f":"IFERROR(IF(MATCH(R7,tblMembers[Seat'#],0)<>0,VLOOKUP(R7,tblMembers[],4,FALSE),\"\"),\"\")","v":"Male"},"F2",{"$f":"IFERROR(IF(MATCH(T7,tblMembers[Seat'#],0)<>0,VLOOKUP(T7,tblMembers[],4,FALSE),\"\"),\"\")","v":""},"G2",{"$f":"IFERROR(IF(MATCH(V7,tblMembers[Seat'#],0)<>0,VLOOKUP(V7,tblMembers[],4,FALSE),\"\"),\"\")","v":""},"H2",{"$f":"IFERROR(IF(MATCH(X7,tblMembers[Seat'#],0)<>0,VLOOKUP(X7,tblMembers[],4,FALSE),\"\"),\"\")","v":""},"I2",{"$f":"IFERROR(IF(MATCH(Z7,tblMembers[Seat'#],0)<>0,VLOOKUP(Z7,tblMembers[],4,FALSE),\"\"),\"\")","v":""},"J2"]
[{"$nulls":6},{"$f":"IFERROR(IF(MATCH(H8,tblMembers[Seat'#],0)<>0,VLOOKUP(H8,tblMembers[],4,FALSE),\"\"),\"\")","v":""},"A3",{"$f":"IFERROR(IF(MATCH(J8,tblMembers[Seat'#],0)<>0,VLOOKUP(J8,tblMembers[],4,FALSE),\"\"),\"\")","v":""},"B3",{"$f":"IFERROR(IF(MATCH(L8,tblMembers[Seat'#],0)<>0,VLOOKUP(L8,tblMembers[],4,FALSE),\"\"),\"\")","v":""},"C3",{"$f":"IFERROR(IF(MATCH(N8,tblMembers[Seat'#],0)<>0,VLOOKUP(N8,tblMembers[],4,FALSE),\"\"),\"\")","v":""},"D3",{"$f":"IFERROR(IF(MATCH(P8,tblMembers[Seat'#],0)<>0,VLOOKUP(P8,tblMembers[],4,FALSE),\"\"),\"\")","v":""},"E3",{"$f":"IFERROR(IF(MATCH(R8,tblMembers[Seat'#],0)<>0,VLOOKUP(R8,tblMembers[],4,FALSE),\"\"),\"\")","v":""},"F3",{"$f":"IFERROR(IF(MATCH(T8,tblMembers[Seat'#],0)<>0,VLOOKUP(T8,tblMembers[],4,FALSE),\"\"),\"\")","v":""},"G3",{"$f":"IFERROR(IF(MATCH(V8,tblMembers[Seat'#],0)<>0,VLOOKUP(V8,tblMembers[],4,FALSE),\"\"),\"\")","v":""},"H3",{"$f":"IFERROR(IF(MATCH(X8,tblMembers[Seat'#],0)<>0,VLOOKUP(X8,tblMembers[],4,FALSE),\"\"),\"\")","v":""},"I3",{"$f":"IFERROR(IF(MATCH(Z8,tblMembers[Seat'#],0)<>0,VLOOKUP(Z8,tblMembers[],4,FALSE),\"\"),\"\")","v":""},"J3"]
[{"$nulls":6},{"$f":"IFERROR(IF(MATCH(H9,tblMembers[Seat'#],0)<>0,VLOOKUP(H9,tblMembers[],4,FALSE),\"\"),\"\")","v":""},"A4",{"$f":"IFERROR(IF(MATCH(J9,tblMembers[Seat'#],0)<>0,VLOOKUP(J9,tblMembers[],4,FALSE),\"\"),\"\")","v":""},"B4",{"$f":"IFERROR(IF(MATCH(L9,tblMembers[Seat'#],0)<>0,VLOOKUP(L9,tblMembers[],4,FALSE),\"\"),\"\")","v":""},"C4",{"$f":"IFERROR(IF(MATCH(N9,tblMembers[Seat'#],0)<>0,VLOOKUP(N9,tblMembers[],4,FALSE),\"\"),\"\")","v":""},"D4",{"$f":"IFERROR(IF(MATCH(P9,tblMembers[Seat'#],0)<>0,VLOOKUP(P9,tblMembers[],4,FALSE),\"\"),\"\")","v":""},"E4",{"$f":"IFERROR(IF(MATCH(R9,tblMembers[Seat'#],0)<>0,VLOOKUP(R9,tblMembers[],4,FALSE),\"\"),\"\")","v":""},"F4",{"$f":"IFERROR(IF(MATCH(T9,tblMembers[Seat'#],0)<>0,VLOOKUP(T9,tblMembers[],4,FALSE),\"\"),\"\")","v":""},"G4",{"$f":"IFERROR(IF(MATCH(V9,tblMembers[Seat'#],0)<>0,VLOOKUP(V9,tblMembers[],4,FALSE),\"\"),\"\")","v":""},"H4",{"$f":"IFERROR(IF(MATCH(X9,tblMembers[Seat'#],0)<>0,VLOOKUP(X9,tblMembers[],4,FALSE),\"\"),\"\")","v":""},"I4",{"$f":"IFERROR(IF(MATCH(Z9,tblMembers[Seat'#],0)<>0,VLOOKUP(Z9,tblMembers[],4,FALSE),\"\"),\"\")","v":""},"J4"]
[{"$nulls":6},{"$f":"IFERROR(IF(MATCH(H10,tblMembers[Seat'#],0)<>0,VLOOKUP(H10,tblMembers[],4,FALSE),\"\"),\"\")","v":""},"A5",{"$f":"IFERROR(IF(MATCH(J10,tblMembers[Seat'#],0)<>0,VLOOKUP(J10,tblMembers[],4,FALSE),\"\"),\"\")","v":""},"B5",{"$f":"IFERROR(IF(MATCH(L10,tblMembers[Seat'#],0)<>0,VLOOKUP(L10,tblMembers[],4,FALSE),\"\"),\"\")","v":""},"C5",{"$f":"IFERROR(IF(MATCH(N10,tblMembers[Seat'#],0)<>0,VLOOKUP(N10,tblMembers[],4,FALSE),\"\"),\"\")","v":""},"D5",{"$f":"IFERROR(IF(MATCH(P10,tblMembers[Seat'#],0)<>0,VLOOKUP(P10,tblMembers[],4,FALSE),\"\"),\"\")","v":""},"E5",{"$f":"IFERROR(IF(MATCH(R10,tblMembers[Seat'#],0)<>0,VLOOKUP(R10,tblMembers[],4,FALSE),\"\"),\"\")","v":""},"F5",{"$f":"IFERROR(IF(MATCH(T10,tblMembers[Seat'#],0)<>0,VLOOKUP(T10,tblMembers[],4,FALSE),\"\"),\"\")","v":""},"G5",{"$f":"IFERROR(IF(MATCH(V10,tblMembers[Seat'#],0)<>0,VLOOKUP(V10,tblMembers[],4,FALSE),\"\"),\"\")","v":""},"H5",{"$f":"IFERROR(IF(MATCH(X10,tblMembers[Seat'#],0)<>0,VLOOKUP(X10,tblMembers[],4,FALSE),\"\"),\"\")","v":""},"I5",{"$f":"IFERROR(IF(MATCH(Z10,tblMembers[Seat'#],0)<>0,VLOOKUP(Z10,tblMembers[],4,FALSE),\"\"),\"\")","v":""},"J5"]
{"$rows_left_out":11}
{"sheet":"Books","index":3,"n_rows":22,"n_cols":16,"rows_kept":22}
["C-Panel"]
["Sel Rw:",11,{"$nulls":4},"Books"]
["Sel Db Rw:",7]
["Scrl Ctrl:",1]
[]
[]
[{"$nulls":7},"Title","Author","Category","Issue Date","Member's Name","Seat #","Duration","Return Date","Status"]
[{"$nulls":5},{"$f":"B4","v":1},null,{"$f":"IFERROR(IF(INDEX(tblBookReg,F8,COLUMN(A1))=0,\"\",INDEX(tblBookReg,F8,COLUMN(A1))),\"\")","v":"Ace quant"},{"$f":"IFERROR(IF(INDEX(tblBookReg,F8,COLUMN(B1))=0,\"\",INDEX(tblBookReg,F8,COLUMN(B1))),\"\")","v":"Adda"},{"$f":"IFERROR(IF(INDEX(tblBookReg,F8,COLUMN(C1))=0,\"\",INDEX(tblBookReg,F8,COLUMN(C1))),\"\")","v":"Quant"},{"$f":"IFERROR(IF(INDEX(tblBookReg,F8,COLUMN(D1))=0,\"\",INDEX(tblBookReg,F8,COLUMN(D1))),\"\")","v":"2024-05-06"},{"$f":"IFERROR(IF(INDEX(tblBookReg,F8,COLUMN(E1))=0,\"\",INDEX(tblBookReg,F8,COLUMN(E1))),\"\")","v":"John Smith"},{"$f":"IFERROR(IF(INDEX(tblBookReg,F8,COLUMN(F1))=0,\"\",INDEX(tblBookReg,F8,COLUMN(F1))),\"\")","v":"A1"},{"$f":"IFERROR(IF(INDEX(tblBookReg,F8,COLUMN(G1))=0,\"\",INDEX(tblBookReg,F8,COLUMN(G1))),\"\")","v":4},{"$f":"IFERROR(IF(INDEX(tblBookReg,F8,COLUMN(H1))=0,\"\",INDEX(tblBookReg,F8,COLUMN(H1))),\"\")","v":"2024-05-10"},{"$f":"IFERROR(IF(INDEX(tblBookReg,F8,COLUMN(I1))=0,\"\",INDEX(tblBookReg,F8,COLUMN(I1))),\"\")","v":"Returned"}]
[{"$nulls":5},{"$f":"F8+1","v":2},null,"English Speaking","M.S. Khurana","English","2024-05-07","Dhirendra Modi","B9",3,"2024-05-10","Issued"]
[{"$nulls":5},{"$f":"F9+1","v":3},null,"Reasoning Ability","Dr. Haldiram","Reasoning","2024-05-07","Pooja Khajuri","C6",2,"2024-05-09","Issued"]
{"$rows_left_out":13}
{"sheet":"Settings","index":4,"n_rows":27,"n_cols":13,"rows_kept":27,"merged":[[7,14,10,14]]}
[]
[{"$nulls":6},"Settings"]
[]
[]
[]
[{"$nulls":7},"Subscription Plan",{"$nulls":3},"General Settings"]
[]
[{"$nulls":7},"Plan Type","Duration (in Day)","Amount",null,"Library Name:","Private Library System"]
[{"$nulls":7},"1 Month",30,{"v":1000,"d":"₹ 1,000"},null,"Address:","123, ifill Tower, New City - 451666"]
[{"$nulls":7},"3 Month",90,{"v":2700,"d":"₹ 2,700"},null,"Phone:",1234567890]
{"$rows_left_out":18}
{"sheet":"Book_Register","index":5,"n_rows":7,"n_cols":9,"rows_kept":7,"hidden":true}
["Books Register"]
[]
["Title","Author","Category","Issue Date","Member's Name","Seat #","Duration","Return Date","Status"]
["Ace quant","Adda","Quant","2024-05-06","John Smith","A1",4,"2024-05-10","Returned"]
["English Speaking","M.S. Khurana","English","2024-05-07","Dhirendra Modi","B9",3,"2024-05-10","Issued"]
["Reasoning Ability","Dr. Haldiram","Reasoning","2024-05-07","Pooja Khajuri","C6",2,"2024-05-09","Issued"]
["The Secret","Falana","Self Help","2024-05-15","Dinesh Ganjewala","E10",5,"2024-05-20","Returned"]

{"sheet":"Books_inventory","index":6,"n_rows":7,"n_cols":3,"rows_kept":7,"hidden":true}
["Books Inventory"]
[]
["Title","Author","Category"]
["English Speaking","M.S. Khurana","English"]
["Ace quant","Adda","Quant"]
["Reasoning Ability","Dr. Haldiram","Reasoning"]
["The Secret","Falana","Self Help"]

{"sheet":"Receipt","index":7,"n_rows":22,"n_cols":6,"rows_kept":22,"hidden":true,"merged":[[1,5,1,6],[2,5,2,6],[13,5,13,6],[14,5,16,6]]}
[]
[null,null,{"$f":"compName","v":"Private Library System"},null,null,{"$f":"compPh","v":1234567890}]
[null,null,{"$f":"compAdd","v":"123, ifill Tower, New City - 451666"},null,null,{"$f":"compMail","v":"pls@email.com"}]
[]
[]
[null,"Member Name:",{"$f":"IFERROR(VLOOKUP($F$15,tblMembers[],2,FALSE),\"\")","v":"Radha Sharma"}]
[null,"Gender:",{"$f":"IFERROR(VLOOKUP($F$15,tblMembers[],4,FALSE),\"\")","v":"Female"}]
[null,"Father's Name:",{"$f":"IFERROR(VLOOKUP($F$15,tblMembers[],5,FALSE),\"\")","v":"Radheshyam Sharma"}]
[null,"Mother's Name:",{"$f":"IFERROR(VLOOKUP($F$15,tblMembers[],6,FALSE),\"\")","v":"Rukmi Sharma"}]
[null,"Address:",{"$f":"IFERROR(VLOOKUP($F$15,tblMembers[],7,FALSE),\"\")","v":"32, Mal Road, Shimla"}]
{"$rows_left_out":13}
{"sheet":"Calc","index":8,"n_rows":33,"n_cols":16,"rows_kept":33,"hidden":true}
["Userform Controls",{"$nulls":10},"Dashboard Setup"]
[]
["Gender",null,"Duration",null,"Books Title:","The Secret",{"$nulls":5},"Total Members:",{"$f":"IFERROR(COUNTA(tblMembers[Seat'#]),\"\")","v":8},null,"Total Earning:",{"$f":"SUM(Members_db!J:J)","v":{"v":34000,"d":"₹ 34,000"}}]
["Male",null,1,null,"Author",{"$f":"IFERROR(VLOOKUP($F$3,Books_inventory!$A$4:$C$5000,2,FALSE),\"\")","v":"Falana"},{"$nulls":5},"Active Members:",{"$f":"COUNTIF(tblMembers[Status],\"Active\")","v":7}]
["Female",null,2,null,"Category",{"$f":"IFERROR(VLOOKUP($F$3,Books_inventory!$A$4:$C$5000,3,FALSE),\"\")","v":"Self Help"},{"$nulls":5},"Exipired Members:",{"$f":"COUNTIF(tblMembers[Status],\"Expired\")","v":1}]
[null,null,3]
[null,null,4,null,"Seat#","E10",{"$nulls":5},"Total Books:",{"$f":"COUNTA(Books_inventory!A4:A9999)","v":4}]
[null,null,5,null,"Member:",{"$f":"IFERROR(VLOOKUP(F7,tblMembers[],2,FALSE),\"\")","v":"Dinesh Ganjewala"},{"$nulls":5},"Issued:",{"$f":"COUNTIF(Book_Register!I4:'Book_Register'!I9999,\"Issued\")","v":2}]
[null,null,6,{"$nulls":8},"Delay:",{"$f":"COUNTIF(Book_Register!I4:'Book_Register'!I9999,\"Returned\")","v":2}]
[null,null,7]
{"$rows_left_out":24}
{"sheet":"Members_db","index":9,"n_rows":11,"n_cols":39,"rows_kept":11,"hidden":true}
["Members Database",{"$nulls":25},"Seat#","Name","Dob","Gender","Father's Name","Mother's Name","Address","Phone","Subscription","Amount","Issue Date","Expiry Date","Status"]
[]
["Seat#","Name","Dob","Gender","Father's Name","Mother's Name","Address","Phone","Subscription","Amount","Issue Date","Expiry Date","Status",{"$nulls":13},"Seat#","Name","Dob","Gender","Father's Name","Mother's Name","Address","Phone","Subscription","Amount","Issue Date","Expiry Date","Status"]
["A1","John Smith","2024-12-01","Male","Johnathan Smith","Jerry Smith","49, new mal road, shimla - 234345",9876543210,"1 Month",{"v":1000,"d":"₹ 1,000"},"2024-04-07","2024-05-05","Expired"]
["B9","Dhirendra Modi","2020-07-01","Male","Shitendra Modi","Putali bai Modi","12, Nale par mohalla, Sindhwa - 12345",1234567890,"1 Month",{"v":1000,"d":"₹ 1,000"},"2024-05-06","2024-06-05","Active"]
["E8","Sila Sharma","2010-01-01","Female","Shelendra Sharma","Saraswati Sharma","45, Ramgarh, Up - 12345",9876543210,"6 Month",{"v":1000,"d":"₹ 1,000"},"2024-05-05","2024-06-04","Active"]
["C6","Pooja Khajuri","2023-06-08","Female","Mehul Khajuri","Neeta Khajuri","17, Ganesh Complex , Indoore, Mp-345465",9876543210,"12 Month",{"v":1000,"d":"₹ 1,000"},"2024-05-06","2024-06-05","Active"]
["F2","Ekesh Kharte","2012-04-05","Male","Gyarsilal kharte","Megna bai kharte","Zakarta, Indoneshiya",1234567890,"6 Month",{"v":5000,"d":"₹ 5,000"},"2024-05-06","2024-11-02","Active"]
["C7","Dipka Malhotra","1994-12-01","Male","Hukmaram Malhotra","Geeta Bai","Musakhedi, Indore - 451002",1234567890,"6 Month",{"v":5000,"d":"₹ 5,000"},"2024-05-12","2024-11-08","Active"]
["E10","Dinesh Ganjewala","2003-01-01","Male","Jagdish","Gunja","Chamarkundiya, Khurmabad",1234567890,"12 Month",{"v":10000,"d":"₹ 10,000"},"2024-05-12","2025-05-07","Active"]
{"$rows_left_out":1}